Unnamed: 0,Unnamed: 1,Unnamed: 2,Unnamed: 3,Unnamed: 4,Unnamed: 5,Unnamed: 6,Unnamed: 7,Unnamed: 8,Unnamed: 9,Unnamed: 10,Unnamed: 11,Unnamed: 12,Unnamed: 13,Unnamed: 14,Unnamed: 15,Unnamed: 16,Unnamed: 17,Unnamed: 18,Unnamed: 19,Unnamed: 20
Fig. 1B,,,,,,,,,,,,,Fig. 1D,,,,,,,
,Group1,ID/Case No,No. of virus particles/100 µM2,,,Group2,ID/Case No,No. of virus particles/100 µM2,,,,,Group1,ID/Case No,No. of Capsid positive cells/100 µM2,,,Group2,ID/Case No,No. of virus particles/100 µM2
,Cov-NND,6609,17,,,Cov-ND,6435,32,,,,,Cov-NND,6609,2,,,Cov-ND,6435,5
,,,15,,,,,25,,,,,,,3,,,,,3
,,,12,,,,,26,,,,,,,1,,,,,2
,,6436,15,,,,5922,27,,,,,,6436,2,,,,5922,4
,,,14,,,,,26,,,,,,,1,,,,,3
,,,12,,,,,24,,,,,,,2,,,,,3
,,6437,15,,,,6782,26,,,,,,6437,2,,,,6782,3
,,,18,,,,,23,,,,,,,2,,,,,3
,,,16,,,,,24,,,,,,,2,,,,,2
,,3160,11,,,,6783,32,,,,,,3160,2,,,,6783,2
,,,7,,,,,28,,,,,,,0.7,,,,,2
,,,9,,,,,27,,,,,,,1,,,,,3
,,3162,6,,,,6795,26,,,,,,3162,0.7,,,,6795,4
,,,5,,,,,28,,,,,,,0.5,,,,,3
,,,5,,,,,26,,,,,,,1,,,,,3
,,3166,11,,,,,,,,,,,3166,1,,,,,
,,,10,,,,,,,,,,,,1,,,,,
,,,9,,,,,,,,,,,,1,,,,,
,,3170,11,,,,,,,,,,,3170,1,,,,,
,,,11,,,,,,,,,,,,1,,,,,
,,,13,,,,,,,,,,,,2,,,,,
,,3180,6,,,,,,,,,,,3180,1,,,,,
,,,10,,,,,,,,,,,,1,,,,,
,,,5,,,,,,,,,,,,1,,,,,
,,3193,3,,,,,,,,,,,3193,0.7,,,,,
,,,11,,,,,,,,,,,,1,,,,,
,,,5,,,,,,,,,,,,0.7,,,,,
,,6576,10,,,,,,,,,,,6576,2,,,,,
,,,12,,,,,,,,,,,,1,,,,,
,,,14,,,,,,,,,,,,1,,,,,
,,5932,9,,,,,,,,,,,5932,2,,,,,
,,,11,,,,,,,,,,,,2,,,,,
,,,11,,,,,,,,,,,,1,,,,,
,,3177,10,,,,,,,,,,,,,,,,,
,,,7,,,,,,,,,,,,,,,,,
,,,9,,,,,,,,,,,,,,,,,
